{"text_format":"1","workbook":"xlsx","n_sheets":3,"sheets":["Munkalap","cimke","cimkenyomtato"],"not_rendered":{"charts":0,"images":1,"macros":1,"external_links":0,"defined_names":4,"comments":2,"pivot_tables":2},"unopened":[],"bounds":{"document_bytes":16777216,"sheet_cells":100000,"rows_first":2000,"rows_last":500,"rows_between":2000,"halvings":0,"cell_chars":16384,"cell_head_chars":4096},"cells_cut":0,"cells_raw":0,"read":"whole","date_system":"1900"}

{"sheet":"Munkalap","index":0,"n_rows":289,"n_cols":23,"rows_kept":289,"cut":false,"hidden":false,"merged":[[4,11,4,12],[5,11,5,12],[6,13,6,15],[7,13,7,15],[8,13,8,15],[0,11,1,15],[0,4,0,10],[1,4,1,10],[2,5,2,10],[3,5,3,10],[3,11,3,12],[2,11,2,12],[60,3,60,4],[9,11,9,12],[60,12,60,13],[10,6,10,8],[10,9,10,12],[10,13,10,15],[9,13,9,15],[5,9,5,10],[5,5,5,7],[6,5,6,10],[7,5,7,10],[4,5,4,10],[0,2,0,3],[2,2,2,3],[1,2,1,3],[3,2,3,3],[4,2,4,3],[57,1,58,1],[44,3,44,4],[6,2,6,3],[10,2,10,5],[0,1,11,1],[46,1,56,1],[44,1,45,1],[45,2,45,13],[9,2,9,3],[7,2,7,3],[8,2,8,3],[8,11,8,12],[7,11,7,12],[6,11,6,12],[8,5,8,10],[9,5,9,10],[46,14,46,15],[47,14,47,15],[48,14,48,15],[49,14,49,15],[50,14,50,15],[56,14,56,15],[57,13,57,15],[51,14,51,15],[52,14,52,15],[53,14,53,15],[54,14,54,15],[55,14,55,15]]}
[null,"Árumegnevezés kiválasztása: ráállunk az első mezőre (ez alatti mező), a jobbszéli nyilra klikkelünk, és a legördülő menüből kiválasztjuk a kívánt megnevezést! Ha nem találod meg a kívánt megnevezést, válaszd az utolsó \"XXXXXX\" jelet, és a \"Szállító megjegyzése\" oszlopba írd be a saját megnevezésedet!\nCsak a zöld fejlécű mezőbe írjunk, a többiben képlet van, ill. védett mezők!","Vevő neve:",null," MARTIN METALS Kft.",null,null,null,null,null,null,"Rakományjegyzék"]
[null,null,"Vevő székhely címe:",null,"   8000 Székesfehérvár, Nagyszombati u. 43.",null,null,null,null,null,null,null,null,null,null,null,null,null,null,null,null,"Alumínium hulladék",20000000]
[null,null,"Vevő telephely címe:",null,"   8104 Várpalota, Fehérvári út 26.","8104 Várpalota Fehérvári u.26",null,null,null,null,null,"Dátum:",null,null,null,null,null,null,null,null,null,"Al minősítés alatt",20000001]
[null,null,"Vevő adószáma:",null,"13108809-2-07",null,null,null,null,null,null,"Szállító jármű típusa:",null,null,null,null,null,null,null,null,null,"200140 Alu hull.",200140]
[null,null,"Fémker. eng.sz:",null,"FE00002500001",null,null,null,null,null,null,"Jármű rendszám:",null,null,null,null,null,null,null,null,null,"Al hulladék Al99,5",20101050]
[null,null,"Szállító neve: ",null,null,null,null,null,"Kódja:",null,null,"Fuvarozó neve:",null,null,null,null,null,null,null,null,null,"Al hulladék huzal 99,5-99,7",20101070]
[null,null,"Székhelyének címe:",null,null,null,null,null,null,null,null,"Székhelyének címe:",null,null,null,null,null,null,null,null,null,"Al hulladék standard Al99,0-99,5",20101300]
[null,null,"Telephelyének címe:",null,null,null,null,null,null,null,null,"Telephelyének címe:",null,null,null,null,null,null,null,null,null,"Al hulladék kábel bevonatos",20111050]
[null,null,"Adószáma:",null,null,null,null,null,null,null,null,"Adószáma:",null,null,null,null,null,null,null,null,null,"Al hulladék 99,5 bevonatos vékony",20111060]
[null,null,"Fémker. eng.sz:",null,null,null,null,null,null,null,null,"Fémker. eng.sz:",null,null,null,null,null,null,null,null,null,"Al hulladék huzal bevonatos",20111070]
[null,null,null,null,null,null,"Feladási súlyok (kg):",null,null,"Átvételi súlyok (kg):",null,null,null,"Megjegyzések",null,null,null,null,null,null,null,"Al hulladék Offset-litho",20111100]
[null,null,"Sor-szám:","Cikkszám:","VTSZ","Raklap jele:","Bruttó feladási","Tára feladási","Nettó feladási","Bruttó átvételi","Tára átvételi","Nettó átvételi","Helykód","Megnevezés","Cikkszám","Megjegyzés",null,"feladás",null,"átvétel",null,"Al hulladék 99,0-99,5 bevonatos",20111300]
[1,null,1,{"$f":"IF(B13>0,VLOOKUP(B13,$V:$W,2,FALSE),\"\")","v":""},null,null,null,null,{"$f":"IF(G13>0,G13-H13,\"\")","v":""},null,null,{"$f":"IF(J13>0,J13-K13,\"\")","v":""},null,null,{"$f":"IFERROR(IF(N13<>\"\",VLOOKUP(N13,$V:$W,2,FALSE),D13),\"\")","v":""},null,null,"Sorcímkék",null,"Sorcímkék",null,"Al hulladék offset papiros",20121100]
[2,null,2,{"$f":"IF(B14>0,VLOOKUP(B14,$V:$W,2,FALSE),\"\")","v":""},null,null,null,null,"",null,null,{"$f":"IF(J14>0,J14-K14,\"\")","v":""},null,null,{"$f":"IFERROR(IF(N14<>\"\",VLOOKUP(N14,$V:$W,2,FALSE),D14),\"\")","v":""},null,null,"Végösszeg",null,"Végösszeg",null,"Al hulladék stripes",20121300]
[3,null,3,"",null,null,null,null,"",null,null,"",null,null,"",null,null,null,null,null,null,"Al hulladék Al99,5 fóliás",20131050]
[4,null,4,"",null,null,null,null,"",null,null,"",null,null,"",null,null,null,null,null,null,"Al hulladék huzal 99,5-99,7 oxidos",20141070]
[5,null,5,"",null,null,null,null,"",null,null,"",null,null,"",null,null,null,null,null,null,"Al hulladék (Dural)",20202009]
[6,null,6,"",null,null,null,null,"",null,null,"",null,null,"",null,null,null,null,null,null,"Al hulladék AlMn",20303003]
[7,null,7,"",null,null,null,null,"",null,null,"",null,null,"",null,null,null,null,null,null,"Al hulladék AlMn1Mg1",20303004]
[8,null,8,"",null,null,null,null,"",null,null,"",null,null,"",null,null,null,null,null,null,"Al hulladék AlMn1Mg1 bevonatos",20313004]
[9,null,9,"",null,null,null,null,"",null,null,"",null,null,"",null,null,null,null,null,null,"Al hulladék AlMn fólia",20323003]
[10,null,10,"",null,null,null,null,"",null,null,"",null,null,"",null,null,null,null,null,null,"Al hulladék AlMn1Mg1 fólia",20323004]
[11,null,11,"",null,null,null,null,"",null,null,"",null,null,"",null,null,null,null,null,null,"Al hulladék öntvény \"0 Fe\"",20404000]
[12,null,12,"",null,null,null,null,"",null,null,"",null,null,"",null,null,null,null,null,null,"Al hulladék keréktárcsa",20404001]
[13,null,13,"",null,null,null,null,{"$f":"IF(G25>0,G25-H25,\"\")","v":""},null,null,"",null,null,"",null,null,null,null,null,null,"Al hulladék öntvény \"0 Fe\" bevonatos",20414000]
[14,null,14,"",null,null,null,null,"",null,null,"",null,null,"",null,null,null,null,null,null,"Al hulladék öntvény \"Fe\"",20494000]
[15,null,15,"",null,null,null,null,"",null,null,"",null,null,"",null,null,null,null,null,null,"Al hulladék AlMg2,5 Cr",20505052]
[16,null,16,"",null,null,null,null,"",null,null,"",null,null,"",null,null,null,null,null,null,"Al hulladék AlMg1-5",20505083]
[17,null,17,"",null,null,null,null,"",null,null,"",null,null,"",null,null,null,null,null,null,"Al hulladék AlMg 4-5 Auto",20505182]
[18,null,18,"",null,null,null,null,"",null,null,"",null,null,"",null,null,null,null,null,null,"Aluhulladék AlMg5-6",20505556]
[19,null,19,"",null,null,null,null,"",null,null,"",null,null,"",null,null,null,null,null,null,"Aluhulladék AlMg1-3",20505754]
[20,null,20,"",null,null,null,null,"",null,null,"",null,null,"",null,null,null,null,null,null,"Al hulladék AlMg1-5 bevonatos",20515083]
[21,null,21,"",null,null,null,null,"",null,null,"",null,null,"",null,null,null,null,null,null,"Al hulladék AlMg1-3 bevonatos",20515754]
[22,null,22,"",null,null,null,null,"",null,null,"",null,null,"",null,null,null,null,null,null,"Aluhulladék AlMg1-3 (fóliázott)",20525754]
[23,null,23,"",null,null,null,null,"",null,null,"",null,null,"",null,null,null,null,null,null,"Al hulladék dugattyú",20604800]
[24,null,24,"",null,null,null,null,"",null,null,"",null,null,"",null,null,null,null,null,null,"Al hulladék AlMgSi1 (6005)",20606005]
[25,null,25,"",null,null,null,null,"",null,null,"",null,null,"",null,null,null,null,null,null,"Al hulladék AlMgSi1 (6016)",20606016]
[26,null,26,"",null,null,null,null,"",null,null,"",null,null,"",null,null,null,null,null,null,"Al hulladék profil (6060)",20606060]
[27,null,27,"",null,null,null,null,"",null,null,"",null,null,"",null,null,null,null,null,null,"Al hulladék AlMgSi1 (6061)",20606061]
[28,null,28,"",null,null,null,null,"",null,null,"",null,null,"",null,null,null,null,null,null,"Al hulladék profil AlMgSi0.5 (6063)",20606063]
{"$rows_left_out":250}
{"sheet":"cimke","index":1,"n_rows":31,"n_cols":11,"rows_kept":31,"cut":false,"hidden":true,"merged":[[16,0,16,1],[16,4,16,5],[14,4,14,5],[14,0,14,1],[13,5,13,6],[13,1,13,2],[0,0,0,1],[0,4,0,5],[8,0,8,1],[8,4,8,5],[6,0,6,1],[5,1,5,2],[5,5,5,6],[6,4,6,5],[30,0,30,1],[29,5,29,6],[30,4,30,5],[24,0,24,1],[24,4,24,5],[21,1,21,2],[22,0,22,1],[21,5,21,6],[22,4,22,5],[29,1,29,2]]}
["Martin Metals Kft.",null,{"$f":"IF(J2>0,VLOOKUP(J2,Munkalap!C13:N44,2,FALSE),\" \")","v":" "},null,"Martin Metals Kft.",null,{"$f":"IF(J3>0,VLOOKUP(J3,Munkalap!C13:N44,2,FALSE),\" \")","v":" "},null,null,"Sorszám","számot írj!"]
["Bejövő helykód",{"$f":"IF(J2>0,VLOOKUP(J2,Munkalap!A13:N44,13,FALSE),\" \")","v":" "},{"$f":"IF(J2>0,VLOOKUP(J2,Munkalap!A13:M44,2,FALSE),\" \")","v":" "},null,"Bejövő helykód",{"$f":"IF(J3>0,VLOOKUP(J3,Munkalap!A13:N44,13,FALSE),\" \")","v":" "},{"$f":"IF(J3>0,VLOOKUP(J3,Munkalap!A13:M44,2,FALSE),\" \")","v":" "}]
["Új helykód",null,{"$f":"IF(K2>0,IF(J2>0,VLOOKUP(J2,Munkalap!A13:M44,10,FALSE),\" \"),IF(J2>0,VLOOKUP(J2,Munkalap!A13:M44,7,FALSE),\" \"))","v":" "},null,"Új helykód",null,{"$f":"IF(K3>0,IF(J3>0,VLOOKUP(J3,Munkalap!A13:M44,10,FALSE),\" \"),IF(J3>0,VLOOKUP(J3,Munkalap!A13:M44,7,FALSE),\" \"))","v":" "}]
["Új helykód 2",null,{"$f":"IF(K2>0,IF(J2>0,VLOOKUP(J2,Munkalap!A13:M44,11,FALSE),\" \"),IF(J2>0,VLOOKUP(J2,Munkalap!A13:M44,8,FALSE),\" \"))","v":" "},null,"Új helykód 2",null,{"$f":"IF(K3>0,IF(J3>0,VLOOKUP(J3,Munkalap!A13:M44,11,FALSE),\" \"),IF(J3>0,VLOOKUP(J3,Munkalap!A13:M44,8,FALSE),\" \"))","v":" "}]
[{"$f":"IF(IF(J2>0,VLOOKUP(J2,Munkalap!A13:N44,5,FALSE),\" \")>0,IF(J2>0,VLOOKUP(J2,Munkalap!A13:N44,5,FALSE),\" \"),\"\")","v":" "},null,{"$f":"IF(K2>0,IF(J2>0,VLOOKUP(J2,Munkalap!A13:M44,12,FALSE),\" \"),IF(J2>0,VLOOKUP(J2,Munkalap!A13:M44,9,FALSE),\" \"))","v":" "},null,{"$f":"IF(IF(J3>0,VLOOKUP(J3,Munkalap!A13:N44,5,FALSE),\" \")>0,IF(J3>0,VLOOKUP(J3,Munkalap!A13:N44,5,FALSE),\" \"),\"\")","v":" "},null,{"$f":"IF(K3>0,IF(J3>0,VLOOKUP(J3,Munkalap!A13:M44,12,FALSE),\" \"),IF(J3>0,VLOOKUP(J3,Munkalap!A13:M44,9,FALSE),\" \"))","v":" "}]
["Megjegyzés:",{"$f":"IF(IF(J2>0,VLOOKUP(J2,Munkalap!A13:N44,14,FALSE),\" \")>0,IF(J2>0,VLOOKUP(J2,Munkalap!A13:N44,14,FALSE),\" \"),\"\")","v":" "},null,null,"Megjegyzés:",{"$f":"IF(IF(J3>0,VLOOKUP(J3,Munkalap!A13:N44,14,FALSE),\" \")>0,IF(J3>0,VLOOKUP(J3,Munkalap!A13:N44,14,FALSE),\" \"),\"\")","v":" "},{"$f":"IF(J3>0,VLOOKUP(J3,Munkalap!A13:N44,14,FALSE),\" \")","v":" "}]
[{"$f":"IF(IF(J2>0,Munkalap!H6,\"\")>0,IF(J2>0,Munkalap!H6,\"\"),\"\")","v":""},null,{"$f":"IF(IF(J2>0,Munkalap!#REF!,\"\")>0,IF(J2>0,Munkalap!#REF!,\"\"),\"\")","v":""},null,{"$f":"IF(IF(J3>0,Munkalap!H6,\"\")>0,IF(J3>0,Munkalap!H6,\"\"),\"\")","v":""},null,{"$f":"IF(IF(J3>0,Munkalap!#REF!,\"\")>0,IF(J3>0,Munkalap!#REF!,\"\"),\"\")","v":""}]
[]
["Martin Metals Kft.",null,{"$f":"IF(J4>0,VLOOKUP(J4,Munkalap!C13:N44,2,FALSE),\" \")","v":" "},null,"Martin Metals Kft.",null,{"$f":"IF(J5>0,VLOOKUP(J5,Munkalap!C13:N44,2,FALSE),\" \")","v":" "}]
["Bejövő helykód",{"$f":"IF(J4>0,VLOOKUP(J4,Munkalap!A13:N44,13,FALSE),\" \")","v":" "},{"$f":"IF(J4>0,VLOOKUP(J4,Munkalap!A13:M44,2,FALSE),\" \")","v":" "},null,"Bejövő helykód",{"$f":"IF(J5>0,VLOOKUP(J5,Munkalap!A13:N44,13,FALSE),\" \")","v":" "},{"$f":"IF(J5>0,VLOOKUP(J5,Munkalap!A13:M44,2,FALSE),\" \")","v":" "}]
["Új helykód",null,{"$f":"IF(K4>0,IF(J4>0,VLOOKUP(J4,Munkalap!A13:M44,10,FALSE),\" \"),IF(J4>0,VLOOKUP(J4,Munkalap!A13:M44,7,FALSE),\" \"))","v":" "},null,"Új helykód",null,{"$f":"IF(K5>0,IF(J5>0,VLOOKUP(J5,Munkalap!A13:M44,10,FALSE),\" \"),IF(J5>0,VLOOKUP(J5,Munkalap!A13:M44,7,FALSE),\" \"))","v":" "}]
["Új helykód 2",null,{"$f":"IF(K4>0,IF(J4>0,VLOOKUP(J4,Munkalap!A13:M44,11,FALSE),\" \"),IF(J4>0,VLOOKUP(J4,Munkalap!A13:M44,8,FALSE),\" \"))","v":" "},null,"Új helykód 2",null,{"$f":"IF(K5>0,IF(J5>0,VLOOKUP(J5,Munkalap!A13:M44,11,FALSE),\" \"),IF(J5>0,VLOOKUP(J5,Munkalap!A13:M44,8,FALSE),\" \"))","v":" "}]
[{"$f":"IF(IF(J4>0,VLOOKUP(J4,Munkalap!A13:N44,5,FALSE),\" \")>0,IF(J4>0,VLOOKUP(J4,Munkalap!A13:N44,5,FALSE),\" \"),\"\")","v":" "},null,{"$f":"IF(K4>0,IF(J4>0,VLOOKUP(J4,Munkalap!A13:M44,12,FALSE),\" \"),IF(J4>0,VLOOKUP(J4,Munkalap!A13:M44,9,FALSE),\" \"))","v":" "},null,{"$f":"IF(IF(J5>0,VLOOKUP(J5,Munkalap!A13:N44,5,FALSE),\" \")>0,IF(J5>0,VLOOKUP(J5,Munkalap!A13:N44,5,FALSE),\" \"),\"\")","v":" "},null,{"$f":"IF(K5>0,IF(J5>0,VLOOKUP(J5,Munkalap!A13:M44,12,FALSE),\" \"),IF(J5>0,VLOOKUP(J5,Munkalap!A13:M44,9,FALSE),\" \"))","v":" "}]
["Megjegyzés:",{"$f":"IF(IF(J4>0,VLOOKUP(J4,Munkalap!A13:N44,14,FALSE),\" \")>0,IF(J4>0,VLOOKUP(J4,Munkalap!A13:N44,14,FALSE),\" \"),\"\")","v":" "},{"$f":"IF(J4>0,VLOOKUP(J4,Munkalap!A13:N44,14,FALSE),\" \")","v":" "},null,"Megjegyzés:",{"$f":"IF(IF(J5>0,VLOOKUP(J5,Munkalap!A13:N44,14,FALSE),\" \")>0,IF(J5>0,VLOOKUP(J5,Munkalap!A13:N44,14,FALSE),\" \"),\"\")","v":" "},{"$f":"IF(J5>0,VLOOKUP(J5,Munkalap!A13:N44,14,FALSE),\" \")","v":" "}]
[{"$f":"IF(IF(J4>0,Munkalap!H6,\"\")>0,IF(J4>0,Munkalap!H6,\"\"),\"\")","v":""},null,{"$f":"IF(IF(J4>0,Munkalap!#REF!,\"\")>0,IF(J4>0,Munkalap!#REF!,\"\"),\"\")","v":""},null,{"$f":"IF(IF(J5>0,Munkalap!H6,\"\")>0,IF(J5>0,Munkalap!H6,\"\"),\"\")","v":""},null,{"$f":"IF(IF(J5>0,Munkalap!#REF!,\"\")>0,IF(J5>0,Munkalap!#REF!,\"\"),\"\")","v":""}]
[]
["Martin Metals Kft.",null,{"$f":"IF(J6>0,VLOOKUP(J6,Munkalap!C13:N44,2,FALSE),\" \")","v":" "},null,"Martin Metals Kft.",null,{"$f":"IF(J7>0,VLOOKUP(J7,Munkalap!C13:N44,2,FALSE),\" \")","v":" "}]
["Bejövő helykód",{"$f":"IF(J6>0,VLOOKUP(J6,Munkalap!A13:N44,13,FALSE),\" \")","v":" "},{"$f":"IF(J6>0,VLOOKUP(J6,Munkalap!A13:M44,2,FALSE),\" \")","v":" "},null,"Bejövő helykód",{"$f":"IF(J7>0,VLOOKUP(J7,Munkalap!A13:N44,13,FALSE),\" \")","v":" "},{"$f":"IF(J7>0,VLOOKUP(J7,Munkalap!A13:M44,2,FALSE),\" \")","v":" "}]
["Új helykód",null,{"$f":"IF(K6>0,IF(J6>0,VLOOKUP(J6,Munkalap!A13:M44,10,FALSE),\" \"),IF(J6>0,VLOOKUP(J6,Munkalap!A13:M44,7,FALSE),\" \"))","v":" "},null,"Új helykód",null,{"$f":"IF(K7>0,IF(J7>0,VLOOKUP(J7,Munkalap!A13:M44,10,FALSE),\" \"),IF(J7>0,VLOOKUP(J7,Munkalap!A13:M44,7,FALSE),\" \"))","v":" "}]
["Új helykód 2",null,{"$f":"IF(K6>0,IF(J6>0,VLOOKUP(J6,Munkalap!A13:M44,11,FALSE),\" \"),IF(J6>0,VLOOKUP(J6,Munkalap!A13:M44,8,FALSE),\" \"))","v":" "},null,"Új helykód 2",null,{"$f":"IF(K7>0,IF(J7>0,VLOOKUP(J7,Munkalap!A13:M44,11,FALSE),\" \"),IF(J7>0,VLOOKUP(J7,Munkalap!A13:M44,8,FALSE),\" \"))","v":" "}]
[{"$f":"IF(IF(J6>0,VLOOKUP(J6,Munkalap!A13:N44,5,FALSE),\" \")>0,IF(J6>0,VLOOKUP(J6,Munkalap!A13:N44,5,FALSE),\" \"),\"\")","v":" "},null,{"$f":"IF(K6>0,IF(J6>0,VLOOKUP(J6,Munkalap!A13:M44,12,FALSE),\" \"),IF(J6>0,VLOOKUP(J6,Munkalap!A13:M44,9,FALSE),\" \"))","v":" "},null,{"$f":"IF(IF(J7>0,VLOOKUP(J7,Munkalap!A13:N44,5,FALSE),\" \")>0,IF(J7>0,VLOOKUP(J7,Munkalap!A13:N44,5,FALSE),\" \"),\"\")","v":" "},null,{"$f":"IF(K7>0,IF(J7>0,VLOOKUP(J7,Munkalap!A13:M44,12,FALSE),\" \"),IF(J7>0,VLOOKUP(J7,Munkalap!A13:M44,9,FALSE),\" \"))","v":" "}]
["Megjegyzés:",{"$f":"IF(IF(J6>0,VLOOKUP(J6,Munkalap!A13:N44,14,FALSE),\" \")>0,IF(J6>0,VLOOKUP(J6,Munkalap!A13:N44,14,FALSE),\" \"),\"\")","v":" "},{"$f":"IF(J6>0,VLOOKUP(J6,Munkalap!A13:N44,14,FALSE),\" \")","v":" "},null,"Megjegyzés:",{"$f":"IF(IF(J7>0,VLOOKUP(J7,Munkalap!A13:N44,14,FALSE),\" \")>0,IF(J7>0,VLOOKUP(J7,Munkalap!A13:N44,14,FALSE),\" \"),\"\")","v":" "},{"$f":"IF(J7>0,VLOOKUP(J7,Munkalap!A13:N44,14,FALSE),\" \")","v":" "}]
[{"$f":"IF(IF(J6>0,Munkalap!H6,\"\")>0,IF(J6>0,Munkalap!H6,\"\"),\"\")","v":""},null,{"$f":"IF(IF(J6>0,Munkalap!#REF!,\"\")>0,IF(J6>0,Munkalap!#REF!,\"\"),\"\")","v":""},null,{"$f":"IF(IF(J7>0,Munkalap!H6,\"\")>0,IF(J7>0,Munkalap!H6,\"\"),\"\")","v":""},null,{"$f":"IF(IF(J7>0,Munkalap!#REF!,\"\")>0,IF(J7>0,Munkalap!#REF!,\"\"),\"\")","v":""}]
[]
["Martin Metals Kft.",null,{"$f":"IF(J8>0,VLOOKUP(J8,Munkalap!C13:N44,2,FALSE),\" \")","v":" "},null,"Martin Metals Kft.",null,{"$f":"IF(J9>0,VLOOKUP(J9,Munkalap!C13:N44,2,FALSE),\" \")","v":" "}]
["Bejövő helykód",{"$f":"IF(J8>0,VLOOKUP(J8,Munkalap!A13:N44,13,FALSE),\" \")","v":" "},{"$f":"IF(J8>0,VLOOKUP(J8,Munkalap!A13:M44,2,FALSE),\" \")","v":" "},null,"Bejövő helykód",{"$f":"IF(J9>0,VLOOKUP(J9,Munkalap!A13:N44,13,FALSE),\" \")","v":" "},{"$f":"IF(J9>0,VLOOKUP(J9,Munkalap!A13:M44,2,FALSE),\" \")","v":" "}]
["Új helykód",null,{"$f":"IF(K8>0,IF(J8>0,VLOOKUP(J8,Munkalap!A13:M44,10,FALSE),\" \"),IF(J8>0,VLOOKUP(J8,Munkalap!A13:M44,7,FALSE),\" \"))","v":" "},null,"Új helykód",null,{"$f":"IF(K9>0,IF(J9>0,VLOOKUP(J9,Munkalap!A13:M44,10,FALSE),\" \"),IF(J9>0,VLOOKUP(J9,Munkalap!A13:M44,7,FALSE),\" \"))","v":" "}]
["Új helykód 2",null,{"$f":"IF(K8>0,IF(J8>0,VLOOKUP(J8,Munkalap!A13:M44,11,FALSE),\" \"),IF(J8>0,VLOOKUP(J8,Munkalap!A13:M44,8,FALSE),\" \"))","v":" "},null,"Új helykód 2",null,{"$f":"IF(K9>0,IF(J9>0,VLOOKUP(J9,Munkalap!A13:M44,11,FALSE),\" \"),IF(J9>0,VLOOKUP(J9,Munkalap!A13:M44,8,FALSE),\" \"))","v":" "}]
[{"$f":"IF(IF(J8>0,VLOOKUP(J8,Munkalap!A13:N44,5,FALSE),\" \")>0,IF(J8>0,VLOOKUP(J8,Munkalap!A13:N44,5,FALSE),\" \"),\"\")","v":" "},null,{"$f":"IF(K8>0,IF(J8>0,VLOOKUP(J8,Munkalap!A13:M44,12,FALSE),\" \"),IF(J8>0,VLOOKUP(J8,Munkalap!A13:M44,9,FALSE),\" \"))","v":" "},null,{"$f":"IF(IF(J9>0,VLOOKUP(J9,Munkalap!A13:N44,5,FALSE),\" \")>0,IF(J9>0,VLOOKUP(J9,Munkalap!A13:N44,5,FALSE),\" \"),\"\")","v":" "},null,{"$f":"IF(K9>0,IF(J9>0,VLOOKUP(J9,Munkalap!A13:M44,12,FALSE),\" \"),IF(J9>0,VLOOKUP(J9,Munkalap!A13:M44,9,FALSE),\" \"))","v":" "}]
["Megjegyzés:",{"$f":"IF(IF(J8>0,VLOOKUP(J8,Munkalap!A13:N44,14,FALSE),\" \")>0,IF(J8>0,VLOOKUP(J8,Munkalap!A13:N44,14,FALSE),\" \"),\"\")","v":" "},{"$f":"IF(J8>0,VLOOKUP(J8,Munkalap!A13:N44,14,FALSE),\" \")","v":" "},null,"Megjegyzés:",{"$f":"IF(IF(J9>0,VLOOKUP(J9,Munkalap!A13:N44,14,FALSE),\" \")>0,IF(J9>0,VLOOKUP(J9,Munkalap!A13:N44,14,FALSE),\" \"),\"\")","v":" "},{"$f":"IF(J9>0,VLOOKUP(J9,Munkalap!A13:N44,14,FALSE),\" \")","v":" "}]
[{"$f":"IF(IF(J8>0,Munkalap!H6,\"\")>0,IF(J8>0,Munkalap!H6,\"\"),\"\")","v":""},null,{"$f":"IF(IF(J8>0,Munkalap!#REF!,\"\")>0,IF(J8>0,Munkalap!#REF!,\"\"),\"\")","v":""},null,{"$f":"IF(IF(J9>0,Munkalap!H6,\"\")>0,IF(J9>0,Munkalap!H6,\"\"),\"\")","v":""},null,{"$f":"IF(IF(J9>0,Munkalap!#REF!,\"\")>0,IF(J9>0,Munkalap!#REF!,\"\"),\"\")","v":""}]

{"sheet":"cimkenyomtato","index":2,"n_rows":224,"n_cols":3,"rows_kept":224,"cut":false,"hidden":false,"merged":[[11,0,11,1],[12,1,12,2],[13,0,13,1],[0,0,0,1],[5,1,5,2],[6,0,6,1],[4,0,4,1],[7,0,7,1],[25,0,25,1],[26,1,26,2],[27,0,27,1],[28,0,28,1],[32,0,32,1],[14,0,14,1],[18,0,18,1],[19,1,19,2],[20,0,20,1],[21,0,21,1],[41,0,41,1],[42,0,42,1],[46,0,46,1],[47,1,47,2],[48,0,48,1],[33,1,33,2],[34,0,34,1],[35,0,35,1],[39,0,39,1],[40,1,40,2],[60,0,60,1],[61,1,61,2],[62,0,62,1],[63,0,63,1],[67,0,67,1],[49,0,49,1],[53,0,53,1],[54,1,54,2],[55,0,55,1],[56,0,56,1],[76,0,76,1],[77,0,77,1],[81,0,81,1],[82,1,82,2],[83,0,83,1],[68,1,68,2],[69,0,69,1],[70,0,70,1],[74,0,74,1],[75,1,75,2],[95,0,95,1],[96,1,96,2],[97,0,97,1],[98,0,98,1],[102,0,102,1],[84,0,84,1],[88,0,88,1],[89,1,89,2],[90,0,90,1],[91,0,91,1],[111,0,111,1],[112,0,112,1],[116,0,116,1],[117,1,117,2],[118,0,118,1],[103,1,103,2],[104,0,104,1],[105,0,105,1],[109,0,109,1],[110,1,110,2],[130,0,130,1],[131,1,131,2],[132,0,132,1],[133,0,133,1],[137,0,137,1],[119,0,119,1],[123,0,123,1],[124,1,124,2],[125,0,125,1],[126,0,126,1],[146,0,146,1],[147,0,147,1],[151,0,151,1],[152,1,152,2],[153,0,153,1],[138,1,138,2],[139,0,139,1],[140,0,140,1],[144,0,144,1],[145,1,145,2],[165,0,165,1],[166,1,166,2],[167,0,167,1],[168,0,168,1],[172,0,172,1],[154,0,154,1],[158,0,158,1],[159,1,159,2],[160,0,160,1],[161,0,161,1],[181,0,181,1],[182,0,182,1],[186,0,186,1],[187,1,187,2],[188,0,188,1],[173,1,173,2],[174,0,174,1],[175,0,175,1],[179,0,179,1],[180,1,180,2],[200,0,200,1],[201,1,201,2],[202,0,202,1],[203,0,203,1],[207,0,207,1],[189,0,189,1],[193,0,193,1],[194,1,194,2],[195,0,195,1],[196,0,196,1],[216,0,216,1],[217,0,217,1],[221,0,221,1],[222,1,222,2],[223,0,223,1],[208,1,208,2],[209,0,209,1],[210,0,210,1],[214,0,214,1],[215,1,215,2]]}
["Martin Metals Kft.",null,{"$f":"IF(Munkalap!A13>0,VLOOKUP(Munkalap!A13,Munkalap!$A$13:P44,15,FALSE),\" \")","v":""}]
["Bejövő helykód",{"$f":"IF(Munkalap!A13>0,VLOOKUP(Munkalap!A13,Munkalap!A13:N44,13,FALSE),\" \")","v":0},{"$f":"IF(Munkalap!A13>0,VLOOKUP(Munkalap!A13,Munkalap!$A$13:$P$44,14,FALSE),\" \")","v":0}]
["Új helykód",null,{"$f":"IF(Munkalap!A13>0,VLOOKUP(Munkalap!A13,Munkalap!A13:N44,10,FALSE),\" \")","v":0}]
["Új helykód 2",null,{"$f":"IF(Munkalap!A13>0,VLOOKUP(Munkalap!A13,Munkalap!A13:N44,11,FALSE),\" \")","v":0}]
[{"$f":"IF(Munkalap!A14>0,VLOOKUP(Munkalap!A14,Munkalap!A14:N51,5,FALSE),\" \")","v":0},null,{"$f":"IF(Munkalap!A13>0,VLOOKUP(Munkalap!A13,Munkalap!A13:N44,12,FALSE),\" \")","v":""}]
["Megjegyzés:",{"$f":"IF(Munkalap!A13>0,VLOOKUP(Munkalap!A13,Munkalap!$A$13:$P$44,16,FALSE),\" \")","v":0}]
[{"$f":"IF(Munkalap!$J$6>0,Munkalap!$J$6,\"\")","v":""},null,{"$f":"IF(Munkalap!$N$3>0,Munkalap!$N$3,\"\")","v":""}]
["Martin Metals Kft.",null,{"$f":"IF(Munkalap!A14>0,VLOOKUP(Munkalap!A14,Munkalap!$A$13:P44,15,FALSE),\" \")","v":""}]
["Bejövő helykód",{"$f":"IF(Munkalap!A14>0,VLOOKUP(Munkalap!A14,Munkalap!A14:N51,13,FALSE),\" \")","v":0},{"$f":"IF(Munkalap!A14>0,VLOOKUP(Munkalap!A14,Munkalap!$A$13:$P$44,14,FALSE),\" \")","v":0}]
["Új helykód",null,{"$f":"IF(Munkalap!A14>0,VLOOKUP(Munkalap!A14,Munkalap!A14:N51,10,FALSE),\" \")","v":0}]
["Új helykód 2",null,{"$f":"IF(Munkalap!A14>0,VLOOKUP(Munkalap!A14,Munkalap!A14:N51,11,FALSE),\" \")","v":0}]
[{"$f":"IF(Munkalap!A14>0,VLOOKUP(Munkalap!A14,Munkalap!A14:N51,5,FALSE),\" \")","v":0},null,{"$f":"IF(Munkalap!A14>0,VLOOKUP(Munkalap!A14,Munkalap!A14:N51,12,FALSE),\" \")","v":""}]
["Megjegyzés:",{"$f":"IF(Munkalap!A14>0,VLOOKUP(Munkalap!A14,Munkalap!$A$13:$P$44,16,FALSE),\" \")","v":0}]
[{"$f":"IF(Munkalap!$J$6>0,Munkalap!$J$6,\"\")","v":""},null,{"$f":"IF(Munkalap!$N$3>0,Munkalap!$N$3,\"\")","v":""}]
["Martin Metals Kft.",null,{"$f":"IF(Munkalap!A15>0,VLOOKUP(Munkalap!A15,Munkalap!$A$13:P44,15,FALSE),\" \")","v":""}]
["Bejövő helykód",{"$f":"IF(Munkalap!A15>0,VLOOKUP(Munkalap!A15,Munkalap!A15:N58,13,FALSE),\" \")","v":0},{"$f":"IF(Munkalap!A15>0,VLOOKUP(Munkalap!A15,Munkalap!$A$13:$P$44,14,FALSE),\" \")","v":0}]
["Új helykód",null,{"$f":"IF(Munkalap!A15>0,VLOOKUP(Munkalap!A15,Munkalap!A15:N58,10,FALSE),\" \")","v":0}]
["Új helykód 2",null,{"$f":"IF(Munkalap!A15>0,VLOOKUP(Munkalap!A15,Munkalap!A15:N58,11,FALSE),\" \")","v":0}]
[{"$f":"IF(Munkalap!A15>0,VLOOKUP(Munkalap!A15,Munkalap!A15:N58,5,FALSE),\" \")","v":0},null,{"$f":"IF(Munkalap!A15>0,VLOOKUP(Munkalap!A15,Munkalap!A15:N58,12,FALSE),\" \")","v":""}]
["Megjegyzés:",{"$f":"IF(Munkalap!A15>0,VLOOKUP(Munkalap!A15,Munkalap!$A$13:$P$44,16,FALSE),\" \")","v":0}]
[{"$f":"IF(Munkalap!$J$6>0,Munkalap!$J$6,\"\")","v":""},null,{"$f":"IF(Munkalap!$N$3>0,Munkalap!$N$3,\"\")","v":""}]
["Martin Metals Kft.",null,{"$f":"IF(Munkalap!A16>0,VLOOKUP(Munkalap!A16,Munkalap!$A$13:P44,15,FALSE),\" \")","v":""}]
["Bejövő helykód",{"$f":"IF(Munkalap!A16>0,VLOOKUP(Munkalap!A16,Munkalap!A16:N61,13,FALSE),\" \")","v":0},{"$f":"IF(Munkalap!A16>0,VLOOKUP(Munkalap!A16,Munkalap!$A$13:$P$44,14,FALSE),\" \")","v":0}]
["Új helykód",null,{"$f":"IF(Munkalap!A16>0,VLOOKUP(Munkalap!A16,Munkalap!A16:N61,10,FALSE),\" \")","v":0}]
["Új helykód 2",null,{"$f":"IF(Munkalap!A16>0,VLOOKUP(Munkalap!A16,Munkalap!A16:N61,11,FALSE),\" \")","v":0}]
[{"$f":"IF(Munkalap!A16>0,VLOOKUP(Munkalap!A16,Munkalap!A16:N61,5,FALSE),\" \")","v":0},null,{"$f":"IF(Munkalap!A16>0,VLOOKUP(Munkalap!A16,Munkalap!A16:N61,12,FALSE),\" \")","v":""}]
["Megjegyzés:",{"$f":"IF(Munkalap!A16>0,VLOOKUP(Munkalap!A16,Munkalap!$A$13:$P$44,16,FALSE),\" \")","v":0}]
[{"$f":"IF(Munkalap!$J$6>0,Munkalap!$J$6,\"\")","v":""},null,{"$f":"IF(Munkalap!$N$3>0,Munkalap!$N$3,\"\")","v":""}]
["Martin Metals Kft.",null,{"$f":"IF(Munkalap!A17>0,VLOOKUP(Munkalap!A17,Munkalap!$A$13:P44,15,FALSE),\" \")","v":""}]
["Bejövő helykód",{"$f":"IF(Munkalap!A17>0,VLOOKUP(Munkalap!A17,Munkalap!A17:N61,13,FALSE),\" \")","v":0},{"$f":"IF(Munkalap!A17>0,VLOOKUP(Munkalap!A17,Munkalap!$A$13:$P$44,14,FALSE),\" \")","v":0}]
["Új helykód",null,{"$f":"IF(Munkalap!A17>0,VLOOKUP(Munkalap!A17,Munkalap!A17:N61,10,FALSE),\" \")","v":0}]
["Új helykód 2",null,{"$f":"IF(Munkalap!A17>0,VLOOKUP(Munkalap!A17,Munkalap!A17:N61,11,FALSE),\" \")","v":0}]
[{"$f":"IF(Munkalap!A17>0,VLOOKUP(Munkalap!A17,Munkalap!A17:N61,5,FALSE),\" \")","v":0},null,{"$f":"IF(Munkalap!A17>0,VLOOKUP(Munkalap!A17,Munkalap!A17:N61,12,FALSE),\" \")","v":""}]
["Megjegyzés:",{"$f":"IF(Munkalap!A17>0,VLOOKUP(Munkalap!A17,Munkalap!$A$13:$P$44,16,FALSE),\" \")","v":0}]
[{"$f":"IF(Munkalap!$J$6>0,Munkalap!$J$6,\"\")","v":""},null,{"$f":"IF(Munkalap!$N$3>0,Munkalap!$N$3,\"\")","v":""}]
["Martin Metals Kft.",null,{"$f":"IF(Munkalap!A18>0,VLOOKUP(Munkalap!A18,Munkalap!$A$13:P44,15,FALSE),\" \")","v":""}]
["Bejövő helykód",{"$f":"IF(Munkalap!A18>0,VLOOKUP(Munkalap!A18,Munkalap!A18:N61,13,FALSE),\" \")","v":0},{"$f":"IF(Munkalap!A18>0,VLOOKUP(Munkalap!A18,Munkalap!$A$13:$P$44,14,FALSE),\" \")","v":0}]
["Új helykód",null,{"$f":"IF(Munkalap!A18>0,VLOOKUP(Munkalap!A18,Munkalap!A18:N61,10,FALSE),\" \")","v":0}]
["Új helykód 2",null,{"$f":"IF(Munkalap!A18>0,VLOOKUP(Munkalap!A18,Munkalap!A18:N61,11,FALSE),\" \")","v":0}]
[{"$f":"IF(Munkalap!A18>0,VLOOKUP(Munkalap!A18,Munkalap!A18:N61,5,FALSE),\" \")","v":0},null,{"$f":"IF(Munkalap!A18>0,VLOOKUP(Munkalap!A18,Munkalap!A18:N61,12,FALSE),\" \")","v":""}]
{"$rows_left_out":184}